Target
5-hydroxytryptamine receptor 1A
Ligand
BDBM50109061
Substrate
Meas. Tech.
ChEMBL_320761 (CHEMBL884575)
Ki
11±n/a nM
Citation
 Morphy, RRankovic, Z Designed multiple ligands. An emerging drug discovery paradigm. J Med Chem 48:6523-43 (2005)  
Target
Name:
5-hydroxytryptamine receptor 1A
Synonyms:
5-HT-1A 5-hydroxytryptamine receptor 1A (5-HT-1A) ADRB2RL1 Dopamine D2 receptor and serotonin 1a receptor HTR1A | Serotonin receptor 1A
Type:
Mol. Mass.:
46122.49
Organism:
Homo sapiens (Human)
Description:
Residue:
422
  
Inhibitor
Name:
BDBM50109061
Synonyms:
3-{1-[2-(1H-Indol-4-yloxy)-ethyl]-1,2,3,6-tetrahydro-pyridin-4-yl}-1H-pyrrolo[2,3-b]pyridine | CHEMBL104229
Type:
Small organic molecule
Emp. Form.:
C22H22N4O
Mol. Mass.:
358.4363
SMILES:
C(CN1CCC(=CC1)c1c[nH]c2ncccc12)Oc1cccc2[nH]ccc12
: