Target
Muscarinic acetylcholine receptor M3
Ligand
BDBM50370683
Substrate
Meas. Tech.
ChEMBL_320917 (CHEMBL881344)
Ki
0.820±n/a nM
Citation
 Naito, RYonetoku, YOkamoto, YToyoshima, AIkeda, KTakeuchi, M Synthesis and antimuscarinic properties of quinuclidin-3-yl 1,2,3,4-tetrahydroisoquinoline-2-carboxylate derivatives as novel muscarinic receptor antagonists. J Med Chem 48:6597-606 (2005)  
Target
Name:
Muscarinic acetylcholine receptor M3
Synonyms:
ACM3_RAT Chrm-3 | Chrm3
Type:
Enzyme Catalytic Domain
Mol. Mass.:
66086.66
Organism:
RAT
Description:
Cholinergic, muscarinic M3 CHRM3 RAT::P08483
Residue:
589
  
Inhibitor
Name:
BDBM50370683
Synonyms:
CHEMBL1169543
Type:
Small organic molecule
Emp. Form.:
C23H26N2O2
Mol. Mass.:
362.4647
SMILES:
O=C(O[C@H]1CN2CCC1CC2)N1CCc2ccccc2[C@H]1c1ccccc1
: