Target
Adenosine receptor A2a
Ligand
BDBM50176061
Substrate
Meas. Tech.
ChEMBL_321018 (CHEMBL883651)
Ki
481±n/a nM
Citation
 Minetti, PTinti, MOCarminati, PCastorina, MDi Cesare, MADi Serio, SGallo, GGhirardi, OGiorgi, FGiorgi, LPiersanti, GBartoccini, FTarzia, G 2-n-Butyl-9-methyl-8-[1,2,3]triazol-2-yl-9H-purin-6-ylamine and analogues as A2A adenosine receptor antagonists. Design, synthesis, and pharmacological characterization. J Med Chem 48:6887-96 (2005)  
Target
Name:
Adenosine receptor A2a
Synonyms:
A2A adenosine receptor (hA2A) ADENOSINE A2 ADORA2 Adenosine A2A receptor (A2AAR)
Type:
G Protein-Coupled Receptor (GPCR)
Mol. Mass.:
44716.46
Organism:
Homo sapiens (Human)
Description:
P29274
Residue:
412
  
Inhibitor
Name:
BDBM50176061
Synonyms:
2-Isopropyl-9-methyl-8-[1,2,3]triazol-2-yl-9H-purin-6-ylamine | CHEMBL195001
Type:
Small organic molecule
Emp. Form.:
C11H14N8
Mol. Mass.:
258.2825
SMILES:
CC(C)c1nc(N)c2nc(-n3nccn3)n(C)c2n1
: