Target
C-C chemokine receptor type 1
Ligand
BDBM50174702
Substrate
Meas. Tech.
ChEMBL_325887 (CHEMBL863244)
IC50
30±n/a nM
Citation
 Revesz, LBollbuck, BBuhl, TEder, JEsser, RFeifel, RHeng, RHiestand, PJachez-Demange, BLoetscher, PSparrer, HSchlapbach, AWaelchli, R Novel CCR1 antagonists with oral activity in the mouse collagen induced arthritis. Bioorg Med Chem Lett 15:5160-4 (2005)  
Target
Name:
C-C chemokine receptor type 1
Synonyms:
C-C CKR-1 CC-CKR-1 CCR1 CD_antigen=CD191 CMKR1 LD78 receptor Macrophage inflammatory protein 1-alpha receptor SCYAR1
Type:
Enzyme
Mol. Mass.:
41180.69
Organism:
Homo sapiens (Human)
Description:
P32246
Residue:
355
  
Inhibitor
Name:
BDBM50174702
Synonyms:
(R)-N-(2-(3-(4-(4-fluorobenzyl)-2-methylpiperazin-1-yl)-3-oxoprop-1-enyl)-5-chlorophenyl)acetamide | CHEMBL198949
Type:
Small organic molecule
Emp. Form.:
C23H25ClFN3O2
Mol. Mass.:
429.915
SMILES:
C[C@@H]1CN(Cc2ccc(F)cc2)CCN1C(=O)\C=C\c1ccc(Cl)cc1NC(C)=O
: