Target
Glutamate receptor ionotropic, kainate 2
Ligand
BDBM26431
Substrate
Meas. Tech.
ChEMBL_326525 (CHEMBL862730)
Ki
3280±n/a nM
Citation
 Dolman, NPTroop, HMMore, JCAlt, AKnauss, JLNistico, RJack, SMorley, RMBortolotto, ZARoberts, PJBleakman, DCollingridge, GLJane, DE Synthesis and pharmacology of willardiine derivatives acting as antagonists of kainate receptors. J Med Chem 48:7867-81 (2005)  
Target
Name:
Glutamate receptor ionotropic, kainate 2
Synonyms:
GRIK2_RAT Glutamate receptor ionotropic kainate 2 Ionotropic glutamate receptor kainate 2/5
Type:
PROTEIN
Mol. Mass.:
102478.61
Organism:
Rattus norvegicus
Description:
ChEMBL_936439
Residue:
908
  
Inhibitor
Name:
BDBM26431
Synonyms:
(2R)-2-aminopentanedioic acid D-Glu D-[14C]Glu
Type:
radiolabeled amino acid
Emp. Form.:
C5H9NO4
Mol. Mass.:
147.1293
SMILES:
N[C@H](CCC(O)=O)C(O)=O
: