Target
Oxytocin receptor
Ligand
BDBM50326722
Substrate
Meas. Tech.
ChEMBL_326541 (CHEMBL863361)
Ki
0.67±n/a nM
Citation
 Quattropani, ADorbais, JCovini, DPittet, PAColovray, VThomas, RJCoxhead, RHalazy, SScheer, AMissotten, MAyala, GBradshaw, CDe Raemy-Schenk, AMNichols, ACirillo, RTos, EGGiachetti, CGolzio, LMarinelli, PChurch, DJBarberis, CChollet, ASchwarz, MK Discovery and development of a new class of potent, selective, orally active oxytocin receptor antagonists. J Med Chem 48:7882-905 (2005)  
Target
Name:
Oxytocin receptor
Synonyms:
OT-R Otr Oxytocin
Type:
Enzyme Catalytic Domain
Mol. Mass.:
42889.28
Organism:
RAT
Description:
Oxytocin OXTR RAT::P70536
Residue:
388
  
Inhibitor
Name:
BDBM50326722
Synonyms:
(Z)-3-(4-(N-(4-chlorophenyl)-N-(2-oxo-2-(2-(2-oxoindolin-3-ylidene)hydrazinyl)ethyl)sulfamoyl)phenyl)-N-(3-(dimethylamino)propyl)propanamide CHEMBL445816
Type:
Small organic molecule
Emp. Form.:
C30H33ClN6O5S
Mol. Mass.:
625.138
SMILES:
CN(C)CCCNC(=O)CCc1ccc(cc1)S(=O)(=O)N(CC(=O)N\N=C1/C(=O)Nc2ccccc12)c1ccc(Cl)cc1
: