Target
Alpha-amylase
Ligand
BDBM50174837
Substrate
Meas. Tech.
ChEMBL_326642 (CHEMBL868756)
IC50
193700±n/a nM
Citation
 Seo, WDKim, JHKang, JERyu, HWCurtis-Long, MJLee, HSYang, MSPark, KH Sulfonamide chalcone as a new class of alpha-glucosidase inhibitors. Bioorg Med Chem Lett 15:5514-6 (2005)  
Target
Name:
Alpha-amylase
Synonyms:
AMY_BACLI amyS
Type:
PROTEIN
Mol. Mass.:
58553.00
Organism:
Bacillus licheniformis
Description:
ChEMBL_326642
Residue:
512
  
Inhibitor
Name:
BDBM50174837
Synonyms:
4'-(p-toluenesulfonamide)-3,4-dihydroxy chalcone Sulfonamide chalcone, 5
Type:
Small organic molecule
Emp. Form.:
C22H19NO5S
Mol. Mass.:
409.455
SMILES:
Cc1ccc(cc1)S(=O)(=O)Nc1ccc(cc1)C(=O)\C=C\c1ccc(O)c(O)c1
: