Target
Muscarinic acetylcholine receptor M2
Ligand
BDBM50176726
Substrate
Meas. Tech.
ChEMBL_327856 (CHEMBL863986)
Ki
3.2±n/a nM
Citation
 Starck, JPTalaga, PQuéré, LCollart, PChristophe, BLo Brutto, PJadot, SChimmanamada, DZanda, MWagner, AMioskowski, CMassingham, RGuyaux, M Potent anti-muscarinic activity in a novel series of quinuclidine derivatives. Bioorg Med Chem Lett 16:373-7 (2005)  
Target
Name:
Muscarinic acetylcholine receptor M2
Synonyms:
ACM2_HUMAN Cholinergic, muscarinic M2 Muscarinic acetylcholine receptor M2 and M5 | RecName: Full=Muscarinic acetylcholine receptor M2
Type:
GPCR
Mol. Mass.:
51730.61
Organism:
Homo sapiens (Human)
Description:
P08172
Residue:
466
  
Inhibitor
Name:
BDBM50176726
Synonyms:
1-(2-fluoropyridin-3-yl)-3-(3-methoxyquinuclidin-3-yl)-1-phenylprop-2-yn-1-ol | CHEMBL382213
Type:
Small organic molecule
Emp. Form.:
C22H23FN2O2
Mol. Mass.:
366.4286
SMILES:
COC1(CN2CCC1CC2)C#CC(O)(c1ccccc1)c1cccnc1F
: