Target
Aurora kinase A
Ligand
BDBM50181535
Substrate
Meas. Tech.
ChEMBL_420088 (CHEMBL873731)
IC50
6±n/a nM
Citation
 Jung, FHPasquet, GLambert-van der Brempt, CLohmann, JJWarin, NRenaud, FGermain, HDe Savi, CRoberts, NJohnson, TDousson, CHill, GBMortlock, AAHeron, NWilkinson, RWWedge, SRHeaton, SPOdedra, RKeen, NJGreen, SBrown, EThompson, KBrightwell, S Discovery of novel and potent thiazoloquinazolines as selective Aurora A and B kinase inhibitors. J Med Chem 49:955-70 (2006)  
Target
Name:
Aurora kinase A
Synonyms:
AIK ARK-1 AURA AURKA_HUMAN Aurora 2 Aurora kinase A (AURKA) Aurora kinase A (Aurora-2) Aurora/IPL1-related kinase 1 Breast tumor-amplified kinase IAK1 STK15 GN Serine/threonine kinase 15 Serine/threonine-protein kinase 6 Serine/threonine-protein kinase aurora-A aurora-2 | hARK1
Type:
Serine/threonine-protein kinase
Mol. Mass.:
45830.98
Organism:
Homo sapiens (Human)
Description:
O14965
Residue:
403
  
Inhibitor
Name:
BDBM50181535
Synonyms:
CHEMBL201655 | N-(5-butyl-1,3-thiazol-2-yl)-6-methoxy-7-(3-morpholin-4-ylpropoxy)quinazolin-4-amine
Type:
Small organic molecule
Emp. Form.:
C23H31N5O3S
Mol. Mass.:
457.589
SMILES:
CCCCc1cnc(Nc2ncnc3cc(OCCCN4CCOCC4)c(OC)cc23)s1
: