Target
Alpha-1A/Alpha-1B/Alpha-1D adrenergic receptor
Ligand
BDBM50181839
Substrate
Meas. Tech.
ChEMBL_332084 (CHEMBL858806)
IC50
>10000±n/a nM
Citation
 Becker, DPFlynn, DLMoormann, AENosal, RVillamil, CILoeffler, RGullikson, GWMoummi, CYang, DC Pyrrolizidine esters and amides as 5-HT4 receptor agonists and antagonists. J Med Chem 49:1125-39 (2006)  
Target
Name:
Alpha-1A/Alpha-1B/Alpha-1D adrenergic receptor
Synonyms:
Adrenergic receptor alpha-1
Type:
Mol. Mass.:
Description:
ASSAY_ID of ChEMBL is 306566
Components:
This complex has 3 components.
Component 1
Name:
Alpha-1D adrenergic receptor
Synonyms:
ADA1D_HUMAN ADRA1D Adrenergic receptor alpha Alpha 1D-adrenoreceptor Alpha-1D adrenoceptor adrenergic Alpha1D
Type:
Enzyme Catalytic Domain
Mol. Mass.:
60485.82
Organism:
Homo sapiens (Human)
Description:
adrenergic Alpha1D ADRA1D HUMAN::P25100
Residue:
572
  
Component 2
Name:
Alpha-1B adrenergic receptor
Synonyms:
ADA1B_HUMAN Adrenergic alpha1B Adrenergic receptor alpha Alpha 1B-adrenoreceptor | Alpha-1B adrenergic receptor
Type:
Enzyme
Mol. Mass.:
56862.13
Organism:
Homo sapiens (Human)
Description:
P35368
Residue:
520
  
Component 3
Name:
Alpha-1A adrenergic receptor
Synonyms:
ADA1A_HUMAN ADRA1C Alpha 1A-adrenoceptor Alpha adrenergic receptor 1a Alpha-adrenergic receptor 1c adrenergic Alpha1 | adrenergic Alpha1C
Type:
Cell-surface receptors
Mol. Mass.:
51511.67
Organism:
Homo sapiens (Human)
Description:
P35348
Residue:
466
  
Inhibitor
Name:
BDBM50181839
Synonyms:
CHEMBL202434 | N-exo-((4S,7alphaS)-tetrahydro-1H-pyrrolizin-4(5H)-yl)-6-chloroimidazo[1,2-a]pyridine-8-carboxamide
Type:
Small organic molecule
Emp. Form.:
C16H19ClN4O
Mol. Mass.:
318.801
SMILES:
Clc1cc(C(=O)NC[C@@H]2CCN3CCC[C@@H]23)c2nccn2c1
: