Target
5-hydroxytryptamine receptor 4
Ligand
BDBM50181844
Substrate
Meas. Tech.
ChEMBL_332073 (CHEMBL859606)
EC50
1.5±n/a nM
Citation
 Becker, DPFlynn, DLMoormann, AENosal, RVillamil, CILoeffler, RGullikson, GWMoummi, CYang, DC Pyrrolizidine esters and amides as 5-HT4 receptor agonists and antagonists. J Med Chem 49:1125-39 (2006)  
Target
Name:
5-hydroxytryptamine receptor 4
Synonyms:
5-HT-4 5-HT4L 5-hydroxytryptamine receptor 4 Htr4 Serotonin 4 (5-HT4) receptor
Type:
Enzyme Catalytic Domain
Mol. Mass.:
46117.31
Organism:
RAT
Description:
5-HT4 HTR4 RAT::Q62758
Residue:
406
  
Inhibitor
Name:
BDBM50181844
Synonyms:
(1R,7aS)-hexahydro-1H-pyrrolizin-1-ylmethyl 4-amino-5-chloro-2-methoxybenzoate | CHEMBL201621
Type:
Small organic molecule
Emp. Form.:
C16H21ClN2O3
Mol. Mass.:
324.803
SMILES:
COc1cc(N)c(Cl)cc1C(=O)OC[C@@H]1CCN2CCC[C@@H]12
: