Target
Sodium-dependent noradrenaline transporter
Ligand
BDBM50176259
Substrate
Meas. Tech.
ChEMBL_333146 (CHEMBL865923)
IC50
790±n/a nM
Citation
 Shao, LAbolin, CHewitt, MCKoch, PVarney, M Derivatives of tramadol for increased duration of effect. Bioorg Med Chem Lett 16:691-4 (2005)  
Target
Name:
Sodium-dependent noradrenaline transporter
Synonyms:
Monoamine transporter NET Noradrenaline Transporter (NET) Norepinephrine transporter protein (NET) SLC6A2 Sodium-dependent noradrenaline transporter (NET) | Solute carrier family 6 member 2
Type:
Multi-pass membrane protein
Mol. Mass.:
69337.72
Organism:
Homo sapiens (Human)
Description:
P23975
Residue:
617
  
Inhibitor
Name:
BDBM50176259
Synonyms:
(1R,2R)-2-[(dimethylamino)methyl]-1-(3-methoxyphenyl)cyclohexanol TRAMADOL
Type:
Small organic molecule
Emp. Form.:
C16H25NO2
Mol. Mass.:
263.3752
SMILES:
COc1cccc(c1)[C@@]1(O)CCCC[C@@H]1CN(C)C
: