Target
Receptor tyrosine-protein kinase erbB-2
Ligand
BDBM50182684
Substrate
Meas. Tech.
ChEMBL_334484 (CHEMBL862513)
IC50
0.5±n/a nM
Citation
 Klutchko, SRZhou, HWinters, RTTran, TPBridges, AJAlthaus, IWAmato, DMElliott, WLEllis, PAMeade, MARoberts, BJFry, DWGonzales, AJHarvey, PJNelson, JMSherwood, VHan, HKPace, GSmaill, JBDenny, WAShowalter, HD Tyrosine kinase inhibitors. 19. 6-Alkynamides of 4-anilinoquinazolines and 4-anilinopyrido[3,4-d]pyrimidines as irreversible inhibitors of the erbB family of tyrosine kinase receptors. J Med Chem 49:1475-85 (2006)  
Target
Name:
Receptor tyrosine-protein kinase erbB-2
Synonyms:
2.7.10.1 CD_antigen=CD340 ERBB2_HUMAN FASN/HER2 HER2 MLN19 NEU Proto-oncogene Neu Tyrosine kinase-type cell surface receptor HER2 | p185erbB2
Type:
Mol. Mass.:
137894.47
Organism:
Homo sapiens (Human)
Description:
P04626
Residue:
1255
  
Inhibitor
Name:
BDBM50182684
Synonyms:
CHEMBL437890 | N-[4-[(3-bromo-4-fluorophenyl)amino]pyrido[3,4-d]pyrimidin-6-yl]-5-(4-methyl-1-piperazinyl)-2-pentynamide
Type:
Small organic molecule
Emp. Form.:
C23H23BrFN7O
Mol. Mass.:
512.377
SMILES:
CN1CCN(CCC#CC(=O)Nc2cc3c(Nc4ccc(F)c(Br)c4)ncnc3cn2)CC1
: