Target
Epidermal growth factor receptor
Ligand
BDBM4566
Substrate
Meas. Tech.
ChEMBL_334486 (CHEMBL862515)
IC50
2.5±n/a nM
Citation
 Klutchko, SRZhou, HWinters, RTTran, TPBridges, AJAlthaus, IWAmato, DMElliott, WLEllis, PAMeade, MARoberts, BJFry, DWGonzales, AJHarvey, PJNelson, JMSherwood, VHan, HKPace, GSmaill, JBDenny, WAShowalter, HD Tyrosine kinase inhibitors. 19. 6-Alkynamides of 4-anilinoquinazolines and 4-anilinopyrido[3,4-d]pyrimidines as irreversible inhibitors of the erbB family of tyrosine kinase receptors. J Med Chem 49:1475-85 (2006)  
Target
Name:
Epidermal growth factor receptor
Synonyms:
EGF Receptor Substrate EGFR_HUMAN ERBB1 Epidermal Growth Factor Receptor erbB-1 Epidermal growth factor receptor (EGFR) HER1 Proto-oncogene c-ErbB-1 Tyrosine-Protein Kinase ErbB-1
Type:
Receptor Kinase Domain
Mol. Mass.:
134279.59
Organism:
Homo sapiens (Human)
Description:
P00533
Residue:
1210
  
Inhibitor
Name:
BDBM4566
Synonyms:
4-anilinoquinazoline deriv. 1 N-{4-[(3-bromophenyl)amino]quinazolin-6-yl}but-2-ynamide
Type:
Small organic molecule
Emp. Form.:
C18H13BrN4O
Mol. Mass.:
381.226
SMILES:
CC#CC(=O)Nc1ccc2ncnc(Nc3cccc(Br)c3)c2c1
: