Target
Prothrombin
Ligand
BDBM50177210
Substrate
Meas. Tech.
ChEMBL_334642 (CHEMBL854113)
IC50
18000±n/a nM
Citation
 Kohrt, JTFilipski, KJCody, WLCai, CDudley, DAVan Huis, CAWillardsen, JANarasimhan, LSZhang, ERapundalo, STSaiya-Cork, KLeadley, RJEdmunds, JJ The discovery of fluoropyridine-based inhibitors of the factor VIIa/TF complex--Part 2. Bioorg Med Chem Lett 16:1060-4 (2006)  
Target
Name:
Prothrombin
Synonyms:
Activation peptide fragment 1 Coagulation factor II Prothrombin precursor Thrombin heavy chain | Thrombin light chain
Type:
Protein
Mol. Mass.:
70029.57
Organism:
Homo sapiens (Human)
Description:
P00734
Residue:
622
  
Inhibitor
Name:
BDBM50177210
Synonyms:
4-[6-(3-carbamimidoyl-phenoxy)-4-diisopropylamino-3,5-difluoro-pyridin-2-yloxy]-3'-isopropyl-biphenyl-3-carboxylic acid trifluoro-acetic acid | CHEMBL201835
Type:
Small organic molecule
Emp. Form.:
C34H36F2N4O4
Mol. Mass.:
602.6708
SMILES:
CC(C)N(C(C)C)c1c(F)c(Oc2cccc(c2)C(N)=N)nc(Oc2ccc(cc2C(O)=O)-c2cccc(c2)C(C)C)c1F
: