Target
Delta-type opioid receptor
Ligand
BDBM50183553
Substrate
Meas. Tech.
ChEMBL_335164 (CHEMBL861286)
Ki
1.4±n/a nM
Citation
 Lee, YSAgnes, RSBadghisi, HDavis, PMa, SWLai, JPorreca, FHruby, VJ Design and synthesis of novel hydrazide-linked bifunctional peptides as delta/mu opioid receptor agonists and CCK-1/CCK-2 receptor antagonists. J Med Chem 49:1773-80 (2006)  
Target
Name:
Delta-type opioid receptor
Synonyms:
D-OR-1 Delta opioid receptor OPIATE Delta OPRD1 OPRK1 | opioid receptor, delta 1
Type:
G Protein-Coupled Receptor (GPCR)
Mol. Mass.:
40382.98
Organism:
Homo sapiens (Human)
Description:
Competition binding assays were carried out using membrane preparations from transfected HN9.10 cells that constitutively expressed the delta opioid receptor.
Residue:
372
  
Inhibitor
Name:
BDBM50183553
Synonyms:
CHEMBL375412 | H-Tyr-D-Ala-Gly-Phe-NH-NH-Phe-Asp-Nle-D-Trp-H
Type:
Small organic molecule
Emp. Form.:
C53H63N9O13
Mol. Mass.:
1034.1198
SMILES:
CCCC[C@H](NC(=O)[C@H](CC(O)=O)NC(=O)[C@H](Cc1ccccc1)NN[C@@H](Cc1ccccc1)C(=O)NCC(=O)N[C@H](C)C(=O)N[C@@H](Cc1ccc(O)cc1)C(O)=O)C(=O)N[C@H](Cc1c[nH]c2ccccc12)C(O)=O
: