Target
Falcipain 2
Ligand
BDBM50183405
Substrate
Meas. Tech.
ChEMBL_336664 (CHEMBL859281)
IC50
13200±n/a nM
Citation
 Desai, PVPatny, AGut, JRosenthal, PJTekwani, BSrivastava, AAvery, M Identification of novel parasitic cysteine protease inhibitors by use of virtual screening. 2. The available chemical directory. J Med Chem 49:1576-84 (2006)  
Target
Name:
Falcipain 2
Synonyms:
Cysteine protease falcipain-2 Falcipain-2
Type:
Enzyme
Mol. Mass.:
55912.60
Organism:
Plasmodium falciparum
Description:
Recombinant falcipain-2.
Residue:
484
  
Inhibitor
Name:
BDBM50183405
Synonyms:
4,6-dimethyl-N,N-bis(2-(phenylsulfonyl)ethyl)-1,3,5-triazin-2-amine | CHEMBL380140
Type:
Small organic molecule
Emp. Form.:
C21H24N4O4S2
Mol. Mass.:
460.57
SMILES:
Cc1nc(C)nc(n1)N(CCS(=O)(=O)c1ccccc1)CCS(=O)(=O)c1ccccc1
: