Target
Membrane primary amine oxidase
Ligand
BDBM50184848
Substrate
Meas. Tech.
ChEMBL_341312 (CHEMBL860925)
IC50
4±n/a nM
Citation
 Wang, EYGao, HSalter-Cid, LZhang, JHuang, LPodar, EMMiller, AZhao, JO'rourke, ALinnik, MD Design, synthesis, and biological evaluation of semicarbazide-sensitive amine oxidase (SSAO) inhibitors with anti-inflammatory activity. J Med Chem 49:2166-73 (2006)  
Target
Name:
Membrane primary amine oxidase
Synonyms:
AOC3_RAT Aoc3 Vascular adhesion protein 1 (VAP-1)
Type:
Enzyme
Mol. Mass.:
84979.78
Organism:
Rattus norvegicus (Rat)
Description:
O08590
Residue:
763
  
Inhibitor
Name:
BDBM50184848
Synonyms:
CHEMBL553631 | N'-[2-(2-methylphenyl)allyl]hydrazine hydrochloride
Type:
Small organic molecule
Emp. Form.:
C10H14N2
Mol. Mass.:
162.2316
SMILES:
Cc1ccccc1C(=C)CNN
: