Target
Membrane primary amine oxidase
Ligand
BDBM50184853
Substrate
Meas. Tech.
ChEMBL_341312 (CHEMBL860925)
IC50
3±n/a nM
Citation
 Wang, EYGao, HSalter-Cid, LZhang, JHuang, LPodar, EMMiller, AZhao, JO'rourke, ALinnik, MD Design, synthesis, and biological evaluation of semicarbazide-sensitive amine oxidase (SSAO) inhibitors with anti-inflammatory activity. J Med Chem 49:2166-73 (2006)  
Target
Name:
Membrane primary amine oxidase
Synonyms:
AOC3_RAT Aoc3 Vascular adhesion protein 1 (VAP-1)
Type:
Enzyme
Mol. Mass.:
84979.78
Organism:
Rattus norvegicus (Rat)
Description:
O08590
Residue:
763
  
Inhibitor
Name:
BDBM50184853
Synonyms:
CHEMBL536060 | N'-[2-(4-chlorophenyl)allyl]hydrazine hydrochloride
Type:
Small organic molecule
Emp. Form.:
C9H11ClN2
Mol. Mass.:
182.65
SMILES:
NNCC(=C)c1ccc(Cl)cc1
: