Target
Adenosine receptor A2b
Ligand
BDBM50182980
Substrate
Meas. Tech.
ChEMBL_350238 (CHEMBL860318)
Ki
3862±n/a nM
Citation
 Zhu, RFrazier, CRLinden, JMacdonald, TL N6-ethyl-2-alkynyl NECAs, selective human A3 adenosine receptor agonists. Bioorg Med Chem Lett 16:2416-8 (2006)  
Target
Name:
Adenosine receptor A2b
Synonyms:
AA2BR_HUMAN ADORA2B Adenosine receptors A2b | Adenosine receptors; A2a & A2b
Type:
G Protein-Coupled Receptor (GPCR)
Mol. Mass.:
36341.22
Organism:
Homo sapiens (Human)
Description:
Residue:
332
  
Inhibitor
Name:
BDBM50182980
Synonyms:
(2S,3S,4R,5R)-N-ethyl-5-(6-(ethylamino)-2-((R,S)-3-hydroxy-3-(2-methoxyphenyl)prop-1-ynyl)-9H-purin-9-yl)-3,4-dihydroxy-tetrahydrofuran-2-carboxamide | CHEMBL205327
Type:
Small organic molecule
Emp. Form.:
C24H28N6O6
Mol. Mass.:
496.5157
SMILES:
CCNC(=O)[C@H]1O[C@H]([C@H](O)[C@@H]1O)n1cnc2c(NCC)nc(nc12)C#CC(O)c1ccccc1OC
: