Target
Adenosine receptor A2b
Ligand
BDBM21220
Substrate
Meas. Tech.
ChEMBL_350238 (CHEMBL860318)
Ki
884±n/a nM
Citation
 Zhu, RFrazier, CRLinden, JMacdonald, TL N6-ethyl-2-alkynyl NECAs, selective human A3 adenosine receptor agonists. Bioorg Med Chem Lett 16:2416-8 (2006)  
Target
Name:
Adenosine receptor A2b
Synonyms:
AA2BR_HUMAN ADORA2B Adenosine receptors A2b | Adenosine receptors; A2a & A2b
Type:
G Protein-Coupled Receptor (GPCR)
Mol. Mass.:
36341.22
Organism:
Homo sapiens (Human)
Description:
Residue:
332
  
Inhibitor
Name:
BDBM21220
Synonyms:
(2S,3S,4R,5R)-5-(6-amino-9H-purin-9-yl)-N-ethyl-3,4-dihydroxyoxolane-2-carboxamide Adenosine, N6-Ethyl-carboxamido CHEMBL464859 NECA
Type:
Antineoplastic Agent
Emp. Form.:
C12H16N6O4
Mol. Mass.:
308.2932
SMILES:
CCNC(=O)[C@H]1O[C@H]([C@H](O)[C@@H]1O)n1cnc2c(N)ncnc12
: