Target
Adenosine receptor A2a
Ligand
BDBM50182961
Substrate
Meas. Tech.
ChEMBL_350236 (CHEMBL861496)
Ki
401±n/a nM
Citation
 Zhu, RFrazier, CRLinden, JMacdonald, TL N6-ethyl-2-alkynyl NECAs, selective human A3 adenosine receptor agonists. Bioorg Med Chem Lett 16:2416-8 (2006)  
Target
Name:
Adenosine receptor A2a
Synonyms:
A2A adenosine receptor (hA2A) ADENOSINE A2 ADORA2 Adenosine A2A receptor (A2AAR)
Type:
G Protein-Coupled Receptor (GPCR)
Mol. Mass.:
44716.46
Organism:
Homo sapiens (Human)
Description:
P29274
Residue:
412
  
Inhibitor
Name:
BDBM50182961
Synonyms:
(2S,3S,4R,5R)-N-ethyl-5-(6-(ethylamino)-2-((R,S)-3-hydroxy-3-(3-nitrophenyl)prop-1-ynyl)-9H-purin-9-yl)-3,4-dihydroxy-tetrahydrofuran-2-carboxamide | CHEMBL381972
Type:
Small organic molecule
Emp. Form.:
C23H25N7O7
Mol. Mass.:
511.4873
SMILES:
CCNC(=O)[C@H]1O[C@H]([C@H](O)[C@@H]1O)n1cnc2c(NCC)nc(nc12)C#CC(O)c1cccc(c1)[N+]([O-])=O
: