Target
Adenosine receptor A3
Ligand
BDBM50182967
Substrate
Meas. Tech.
ChEMBL_350240 (CHEMBL861501)
Ki
1.17±n/a nM
Citation
 Zhu, RFrazier, CRLinden, JMacdonald, TL N6-ethyl-2-alkynyl NECAs, selective human A3 adenosine receptor agonists. Bioorg Med Chem Lett 16:2416-8 (2006)  
Target
Name:
Adenosine receptor A3
Synonyms:
A3 adenosine receptor (hA3) ADORA3 | Adenosine A3 receptor (A3AR)
Type:
G Protein-Coupled Receptor (GPCR)
Mol. Mass.:
36197.32
Organism:
Homo sapiens (Human)
Description:
P0DMS8
Residue:
318
  
Inhibitor
Name:
BDBM50182967
Synonyms:
(2S,3S,4R,5R)-N-ethyl-5-(6-(ethylamino)-2-((R,S)-3-hydroxy-3-(3-methoxyphenyl)prop-1-ynyl)-9H-purin-9-yl)-3,4-dihydroxy-tetrahydrofuran-2-carboxamide | CHEMBL383836
Type:
Small organic molecule
Emp. Form.:
C24H28N6O6
Mol. Mass.:
496.5157
SMILES:
CCNC(=O)[C@H]1O[C@H]([C@H](O)[C@@H]1O)n1cnc2c(NCC)nc(nc12)C#CC(O)c1cccc(OC)c1
: