Target
Adenosine receptor A1
Ligand
BDBM50182976
Substrate
Meas. Tech.
ChEMBL_350235 (CHEMBL866264)
Ki
3.47±n/a nM
Citation
 Zhu, RFrazier, CRLinden, JMacdonald, TL N6-ethyl-2-alkynyl NECAs, selective human A3 adenosine receptor agonists. Bioorg Med Chem Lett 16:2416-8 (2006)  
Target
Name:
Adenosine receptor A1
Synonyms:
A1 adenosine receptor (hA1) AA1R_HUMAN ADORA1 Adenosine A1-receptor Adenosine receptor A1 (hA1) | Adenosine transporter (AdT)
Type:
G Protein-Coupled Receptor (GPCR)
Mol. Mass.:
36520.92
Organism:
Homo sapiens (Human)
Description:
P30542
Residue:
326
  
Inhibitor
Name:
BDBM50182976
Synonyms:
(2S,3S,4R,5R)-N-ethyl-5-(6-(ethylamino)-2-((R,S)-3-hydroxy-3-(2-nitrophenyl)prop-1-ynyl)-9H-purin-9-yl)-3,4-dihydroxy-tetrahydrofuran-2-carboxamide | CHEMBL205850
Type:
Small organic molecule
Emp. Form.:
C23H25N7O7
Mol. Mass.:
511.4873
SMILES:
CCNC(=O)[C@H]1O[C@H]([C@H](O)[C@@H]1O)n1cnc2c(NCC)nc(nc12)C#CC(O)c1ccccc1[N+]([O-])=O
: