Target
Androgen receptor
Ligand
BDBM50185212
Substrate
Meas. Tech.
ChEMBL_359728 (CHEMBL869334)
IC50
1000±n/a nM
Citation
 Zhang, XLi, XAllan, GFMusto, ALundeen, SGSui, Z Discovery of indole-containing tetracycles as a new scaffold for androgen receptor ligands. Bioorg Med Chem Lett 16:3233-7 (2006)  
Target
Name:
Androgen receptor
Synonyms:
ANDR_RAT Ar Nr3c4 | androgen
Type:
Enzyme
Mol. Mass.:
98219.08
Organism:
Rattus norvegicus (Rat)
Description:
P15207
Residue:
902
  
Inhibitor
Name:
BDBM50185212
Synonyms:
1-(8-hydroxythiochromeno[4,3-b]indol-11(6H)-yl)ethanone | CHEMBL207518
Type:
Small organic molecule
Emp. Form.:
C17H13NO2S
Mol. Mass.:
295.356
SMILES:
CC(=O)n1c-2c(CSc3ccccc-23)c2cc(O)ccc12
: