Target
3-oxoacyl-acyl-carrier protein reductase
Ligand
BDBM7459
Substrate
Meas. Tech.
ChEMBL_361111 (CHEMBL859177)
Ki
1800±n/a nM
Citation
 Tasdemir, DLack, GBrun, RRüedi, PScapozza, LPerozzo, R Inhibition of Plasmodium falciparum fatty acid biosynthesis: evaluation of FabG, FabZ, and FabI as drug targets for flavonoids. J Med Chem 49:3345-53 (2006)  
Target
Name:
3-oxoacyl-acyl-carrier protein reductase
Synonyms:
Type:
PROTEIN
Mol. Mass.:
33333.53
Organism:
Plasmodium falciparum
Description:
ChEMBL_675156
Residue:
301
  
Inhibitor
Name:
BDBM7459
Synonyms:
2-(3,4-dihydroxyphenyl)-5,7-dihydroxy-4H-chromen-4-one CHEMBL151 Luteolin (4) cid_5280445 med.21724, Compound 3
Type:
Small organic molecule
Emp. Form.:
C15H10O6
Mol. Mass.:
286.2363
SMILES:
Oc1cc(O)c2c(c1)oc(cc2=O)-c1ccc(O)c(O)c1
: