Target
3-oxoacyl-acyl-carrier protein reductase
Ligand
BDBM7457
Substrate
Meas. Tech.
ChEMBL_361105 (CHEMBL859171)
IC50
4100±n/a nM
Citation
 Tasdemir, DLack, GBrun, RRüedi, PScapozza, LPerozzo, R Inhibition of Plasmodium falciparum fatty acid biosynthesis: evaluation of FabG, FabZ, and FabI as drug targets for flavonoids. J Med Chem 49:3345-53 (2006)  
Target
Name:
3-oxoacyl-acyl-carrier protein reductase
Synonyms:
Type:
PROTEIN
Mol. Mass.:
33333.53
Organism:
Plasmodium falciparum
Description:
ChEMBL_675156
Residue:
301
  
Inhibitor
Name:
BDBM7457
Synonyms:
2-(3,4-dihydroxyphenyl)-3,7-dihydroxy-4H-chromen-4-one 2-(3,4-dihydroxyphenyl)-3,7-dihydroxy-chromone;dihydrate Fisetin (14) fisetin
Type:
Small organic molecule
Emp. Form.:
C15H10O6
Mol. Mass.:
286.2363
SMILES:
Oc1ccc2c(c1)oc(-c1ccc(O)c(O)c1)c(O)c2=O
: