Target
Solute carrier family 15 member 1
Ligand
BDBM50188522
Substrate
Meas. Tech.
ChEMBL_363879 (CHEMBL863210)
EC50
270000±n/a nM
Citation
 Vig, BSStouch, TRTimoszyk, JKQuan, YWall, DASmith, RLFaria, TN Human PEPT1 pharmacophore distinguishes between dipeptide transport and binding. J Med Chem 49:3636-44 (2006)  
Target
Name:
Solute carrier family 15 member 1
Synonyms:
Intestinal H(+)/peptide cotransporter Oligopeptide transporter, small intestine isoform Peptide transporter 1 SLC15A1
Type:
PROTEIN
Mol. Mass.:
78818.07
Organism:
Homo sapiens (Human)
Description:
ChEMBL_1488839
Residue:
708
  
Inhibitor
Name:
BDBM50188522
Synonyms:
Arg-Gly | CHEMBL382777
Type:
Small organic molecule
Emp. Form.:
C8H17N5O3
Mol. Mass.:
231.2523
SMILES:
[#7]-[#6@@H](-[#6]-[#6]-[#6]\[#7]=[#6](\[#7])-[#7])-[#6](=O)-[#7]-[#6]-[#6](-[#8])=O
: