Target
Solute carrier family 15 member 1
Ligand
BDBM50169126
Substrate
Meas. Tech.
ChEMBL_363879 (CHEMBL863210)
EC50
530000±n/a nM
Citation
 Vig, BSStouch, TRTimoszyk, JKQuan, YWall, DASmith, RLFaria, TN Human PEPT1 pharmacophore distinguishes between dipeptide transport and binding. J Med Chem 49:3636-44 (2006)  
Target
Name:
Solute carrier family 15 member 1
Synonyms:
Intestinal H(+)/peptide cotransporter Oligopeptide transporter, small intestine isoform Peptide transporter 1 SLC15A1
Type:
PROTEIN
Mol. Mass.:
78818.07
Organism:
Homo sapiens (Human)
Description:
ChEMBL_1488839
Residue:
708
  
Inhibitor
Name:
BDBM50169126
Synonyms:
(S)-2-((S)-2,6-Diamino-hexanoylamino)-pentanedioic acid Lys-Glu
Type:
Small organic molecule
Emp. Form.:
C11H21N3O5
Mol. Mass.:
275.3015
SMILES:
NCCCC[C@H](N)C(=O)N[C@@H](CCC(O)=O)C(O)=O
: