Target
Cyclin-dependent kinase 5 activator 1
Ligand
BDBM50191410
Substrate
Meas. Tech.
ChEMBL_365406 (CHEMBL867889)
IC50
>100000±n/a nM
Citation
 Ferandin, YBettayeb, KKritsanida, MLozach, OPolychronopoulos, PMagiatis, PSkaltsounis, ALMeijer, L 3'-Substituted 7-halogenoindirubins, a new class of cell death inducing agents. J Med Chem 49:4638-49 (2006)  
Target
Name:
Cyclin-dependent kinase 5 activator 1
Synonyms:
CDK5/p35 Cyclin-dependent kinase 5 regulatory subunit 1 | Cyclin-dependent kinase 5/CDK5 activator 1
Type:
Protein Complex
Mol. Mass.:
Description:
Components:
This complex has 2 components.
Component 1
Name:
Cyclin-dependent kinase 5
Synonyms:
CDK5 CDKN5 Cyclin-dependent kinase 5 (CDK5/ p25) Cyclin-dependent-like kinase 5 PSSALRE Tau protein kinase II catalytic subunit
Type:
Enzyme Subunit
Mol. Mass.:
33308.61
Organism:
Homo sapiens (Human)
Description:
Residue:
292
  
Component 2
Name:
Cyclin-dependent kinase 5 activator 1
Synonyms:
CD5R1_HUMAN CDK5R1 Cyclin-dependent kinase 5 (CDK5/p25) NCK5A p35
Type:
Enzyme Subunit
Mol. Mass.:
34077.43
Organism:
Homo sapiens (Human)
Description:
Q15078
Residue:
307
  
Inhibitor
Name:
BDBM50191410
Synonyms:
(Z)-1'-Methyl-1H,1'H-[2,3']biindolylidene-3,2'-dione 3-oxime CHEMBL366438
Type:
Small organic molecule
Emp. Form.:
C17H13N3O2
Mol. Mass.:
291.304
SMILES:
Cn1c(O)c(-c2[nH]c3ccccc3c2N=O)c2ccccc12
: