Target
Aryl hydrocarbon receptor
Ligand
BDBM50191405
Substrate
Meas. Tech.
ChEMBL_365417 (CHEMBL867900)
IC50
20000±n/a nM
Citation
 Ferandin, YBettayeb, KKritsanida, MLozach, OPolychronopoulos, PMagiatis, PSkaltsounis, ALMeijer, L 3'-Substituted 7-halogenoindirubins, a new class of cell death inducing agents. J Med Chem 49:4638-49 (2006)  
Target
Name:
Aryl hydrocarbon receptor
Synonyms:
AHR BHLHE76 aryl hydrocarbon receptor precursor
Type:
PROTEIN
Mol. Mass.:
96143.77
Organism:
Homo sapiens (Human)
Description:
ChEMBL_1503828
Residue:
848
  
Inhibitor
Name:
BDBM50191405
Synonyms:
(2'Z,3'E)-7-bromoindirubin-3'-oxime | CHEMBL373834
Type:
Small organic molecule
Emp. Form.:
C16H10BrN3O2
Mol. Mass.:
356.174
SMILES:
Oc1[nH]c2c(Br)cccc2c1-c1[nH]c2ccccc2c1N=O
: