Target
Complement C3
Ligand
BDBM50191376
Substrate
Meas. Tech.
ChEMBL_365467 (CHEMBL869093)
IC50
545±n/a nM
Citation
 Katragadda, MMagotti, PSfyroera, GLambris, JD Hydrophobic effect and hydrogen bonds account for the improved activity of a complement inhibitor, compstatin. J Med Chem 49:4616-22 (2006)  
Target
Name:
Complement C3
Synonyms:
C3 CPAMD1
Type:
Enzyme
Mol. Mass.:
187142.34
Organism:
Homo sapiens (Human)
Description:
P01024
Residue:
1663
  
Inhibitor
Name:
BDBM50191376
Synonyms:
Ac-ICV(2Nal)QDWGAHRCT-NH2 | CHEMBL434556
Type:
Small organic molecule
Emp. Form.:
C72H102N20O18S2
Mol. Mass.:
1599.833
SMILES:
CC[C@H](C)[C@H](NC(=O)[C@H](CS)NC(=O)[C@@H](NC(=O)[C@H](Cc1ccc2ccccc2c1)NC(=O)[C@H](CCC(N)=O)NC(=O)[C@H](CC(O)=O)NC(=O)[C@H](Cc1c[nH]c2ccccc12)NC(=O)CNC(=O)[C@H](C)NC(=O)[C@H](Cc1cnc[nH]1)NC(=O)[C@H](CCCN=C(N)N)NC(=O)[C@H](CS)NC(=O)[C@@H](N)[C@@H](C)O)C(C)C)C(=O)OC
: