Target
C-C chemokine receptor type 5
Ligand
BDBM50190519
Substrate
Meas. Tech.
ChEMBL_373789 (CHEMBL869753)
IC50
610±n/a nM
Citation
 Habashita, HKokubo, MHamano, SHamanaka, NToda, MShibayama, STada, HSagawa, KFukushima, DMaeda, KMitsuya, H Design, synthesis, and biological evaluation of the combinatorial library with a new spirodiketopiperazine scaffold. Discovery of novel potent and selective low-molecular-weight CCR5 antagonists. J Med Chem 49:4140-52 (2006)  
Target
Name:
C-C chemokine receptor type 5
Synonyms:
C-C CKR-5 CC-CKR-5 CCR5 CCR5_HUMAN CHEMR13 HIV-1 fusion coreceptor
Type:
Enzyme
Mol. Mass.:
40540.21
Organism:
Homo sapiens (Human)
Description:
P51681
Residue:
352
  
Inhibitor
Name:
BDBM50190519
Synonyms:
(3S)-3-cyclohexylmethyl-9-(6-phenylhexyl)-1-propyl-1,4,9-triazaspiro[5.5]undeca-2,5-dione hydrochloride | CHEMBL538084
Type:
Small organic molecule
Emp. Form.:
C30H47N3O2
Mol. Mass.:
481.7131
SMILES:
CCCN1C(=O)[C@H](CC2CCCCC2)NC(=O)C11CCN(CCCCCCc2ccccc2)CC1
: