Target
Muscarinic acetylcholine receptor M3
Ligand
BDBM50190513
Substrate
Meas. Tech.
ChEMBL_373792 (CHEMBL869756)
IC50
2070±n/a nM
Citation
 Habashita, HKokubo, MHamano, SHamanaka, NToda, MShibayama, STada, HSagawa, KFukushima, DMaeda, KMitsuya, H Design, synthesis, and biological evaluation of the combinatorial library with a new spirodiketopiperazine scaffold. Discovery of novel potent and selective low-molecular-weight CCR5 antagonists. J Med Chem 49:4140-52 (2006)  
Target
Name:
Muscarinic acetylcholine receptor M3
Synonyms:
ACM3_HUMAN Cholinergic, muscarinic M3 Muscarinic receptor M3 | RecName: Full=Muscarinic acetylcholine receptor M3
Type:
Enzyme
Mol. Mass.:
66151.03
Organism:
Homo sapiens (Human)
Description:
P20309
Residue:
590
  
Inhibitor
Name:
BDBM50190513
Synonyms:
(RS)-1-butyl-3-(cyclohexylmethyl)-9-((2,3-dihydrobenzo[b][1,4]dioxin-6-yl)methyl)-1,4,9-triazaspiro[5.5]undecane-2,5-dione hydrochloride CHEMBL556798
Type:
Small organic molecule
Emp. Form.:
C28H41N3O4
Mol. Mass.:
483.6428
SMILES:
CCCCN1C(=O)C(CC2CCCCC2)NC(=O)C11CCN(Cc2ccc3OCCOc3c2)CC1
: