Target
Alpha-1A adrenergic receptor
Ligand
BDBM50187748
Substrate
Meas. Tech.
ChEMBL_384612 (CHEMBL866126)
Ki
690±n/a nM
Citation
 Hayashi, ROhmori, EIsogaya, MMoriwaki, MKumagai, H Design and synthesis of selective alpha1B adrenoceptor antagonists. Bioorg Med Chem Lett 16:4045-7 (2006)  
Target
Name:
Alpha-1A adrenergic receptor
Synonyms:
ADA1A_RAT Adra1c Alpha-1A adrenoceptor Alpha-1C adrenergic receptor | adrenergic Alpha1A
Type:
Protein
Mol. Mass.:
51620.15
Organism:
Rattus norvegicus (Rat)
Description:
P43140
Residue:
466
  
Inhibitor
Name:
BDBM50187748
Synonyms:
5-fluoro-3-(1-(3-(piperidin-1-yl)propyl)piperidin-4-yl)-1H-indole dihydrochloride | CHEMBL539601
Type:
Small organic molecule
Emp. Form.:
C21H30FN3
Mol. Mass.:
343.4814
SMILES:
Fc1ccc2[nH]cc(C3CCN(CCCN4CCCCC4)CC3)c2c1
: