Target
Alpha-1D adrenergic receptor
Ligand
BDBM50187747
Substrate
Meas. Tech.
ChEMBL_384615 (CHEMBL866129)
Ki
37±n/a nM
Citation
 Hayashi, ROhmori, EIsogaya, MMoriwaki, MKumagai, H Design and synthesis of selective alpha1B adrenoceptor antagonists. Bioorg Med Chem Lett 16:4045-7 (2006)  
Target
Name:
Alpha-1D adrenergic receptor
Synonyms:
ADA1D_HUMAN ADRA1D Adrenergic receptor alpha Alpha 1D-adrenoreceptor Alpha-1D adrenoceptor adrenergic Alpha1D
Type:
Enzyme Catalytic Domain
Mol. Mass.:
60485.82
Organism:
Homo sapiens (Human)
Description:
adrenergic Alpha1D ADRA1D HUMAN::P25100
Residue:
572
  
Inhibitor
Name:
BDBM50187747
Synonyms:
3-(1-(5-(piperidin-1-yl)pentyl)piperidin-4-yl)-1H-indole dihydrochloride | CHEMBL537651
Type:
Small organic molecule
Emp. Form.:
C23H35N3
Mol. Mass.:
353.5441
SMILES:
C(CCN1CCCCC1)CCN1CCC(CC1)c1c[nH]c2ccccc12
: