Target
Alpha-1B adrenergic receptor
Ligand
BDBM50187757
Substrate
Meas. Tech.
ChEMBL_384613 (CHEMBL866127)
Ki
7.7±n/a nM
Citation
 Hayashi, ROhmori, EIsogaya, MMoriwaki, MKumagai, H Design and synthesis of selective alpha1B adrenoceptor antagonists. Bioorg Med Chem Lett 16:4045-7 (2006)  
Target
Name:
Alpha-1B adrenergic receptor
Synonyms:
ADA1B_RAT Alpha 1B-adrenoceptor Alpha adrenergic receptor 1A and 1B Alpha-1Adrenoceptor Alpha-1B adrenoreceptor | adrenergic Alpha1B
Type:
G Protein-Coupled Receptor (GPCR)
Mol. Mass.:
56606.71
Organism:
Rattus norvegicus (rat)
Description:
Receptor binding assays were performed using rat cortical membranes.
Residue:
515
  
Inhibitor
Name:
BDBM50187757
Synonyms:
1-(3-(4-(benzofuran-3-yl)piperidin-1-yl)propyl)piperidine dihydrochloride | CHEMBL534944
Type:
Small organic molecule
Emp. Form.:
C21H30N2O
Mol. Mass.:
326.4757
SMILES:
C(CN1CCCCC1)CN1CCC(CC1)c1coc2ccccc12
: