Target
GNAT family acetyltransferase
Ligand
BDBM50193487
Substrate
Meas. Tech.
ChEMBL_385423 (CHEMBL869194)
Ki
3.4±n/a nM
Citation
 Gao, FYan, XShakya, TBaettig, OMAit-Mohand-Brunet, SBerghuis, AMWright, GDAuclair, K Synthesis and structure-activity relationships of truncated bisubstrate inhibitors of aminoglycoside 6'-N-acetyltransferases. J Med Chem 49:5273-81 (2006)  
Target
Name:
GNAT family acetyltransferase
Synonyms:
Aminoglycoside acetyltransferase
Type:
PROTEIN
Mol. Mass.:
21017.80
Organism:
Enterococcus durans
Description:
ChEMBL_385423
Residue:
183
  
Inhibitor
Name:
BDBM50193487
Synonyms:
(3R)-3-[(2-{[2-({[(3-{[3-(dimethylamino)propyl]amino}propyl)carbamoyl]methyl}sulfanyl)ethyl]carbamoyl}ethyl)carbamoyl]-3-hydroxy-2,2-dimethylpropyl ({[(2R,3S,4R,5R)-5-(6-amino-9H-purin-9-yl)-4-hydroxy-3-(phosphonatooxy)oxolan-2-yl]methyl phosphonato}oxy)phosphonate truncated aminoglycoside-coenzyme A bisubstrate analogue 4d
Type:
Small organic molecule
Emp. Form.:
C31H53N10O17P3S
Mol. Mass.:
962.798
SMILES:
CN(C)CCCNCCCNC(=O)CSCCNC(=O)CCNC(=O)[C@H](O)C(C)(C)COP([O-])(=O)OP([O-])(=O)OC[C@H]1O[C@H]([C@H](O)[C@@H]1OP([O-])([O-])=O)n1cnc2c(N)ncnc12
: