Target
RNA-directed RNA polymerase
Ligand
BDBM50193060
Substrate
Meas. Tech.
ChEMBL_391864 (CHEMBL862448)
IC50
30±n/a nM
Citation
 Beaulieu, PLGillard, JBykowski, DBrochu, CDansereau, NDuceppe, JSHaché, BJakalian, ALagacé, LLaPlante, SMcKercher, GMoreau, EPerreault, SStammers, TThauvette, LWarrington, JKukolj, G Improved replicon cellular activity of non-nucleoside allosteric inhibitors of HCV NS5B polymerase: from benzimidazole to indole scaffolds. Bioorg Med Chem Lett 16:4987-93 (2006)  
Target
Name:
RNA-directed RNA polymerase
Synonyms:
Hepatitis C virus NS5B RNA-dependent RNA polymerase | NS5B protein
Type:
Protein
Mol. Mass.:
25173.95
Organism:
Hepatitis C virus
Description:
Q8JXU8
Residue:
229
  
Inhibitor
Name:
BDBM50193060
Synonyms:
3-cyclohexyl-2-(furan-3-yl)-1H-indole-6-carboxylic acid | CHEMBL216000
Type:
Small organic molecule
Emp. Form.:
C19H19NO3
Mol. Mass.:
309.3591
SMILES:
OC(=O)c1ccc2c(C3CCCCC3)c([nH]c2c1)-c1ccoc1
: