Target
Receptor tyrosine-protein kinase erbB-2
Ligand
BDBM50189127
Substrate
Meas. Tech.
ChEMBL_396272 (CHEMBL910356)
IC50
20±n/a nM
Citation
 Petrov, KGZhang, YMCarter, MCockerill, GSDickerson, SGauthier, CAGuo, YMook, RARusnak, DWWalker, ALWood, ERLackey, KE Optimization and SAR for dual ErbB-1/ErbB-2 tyrosine kinase inhibition in the 6-furanylquinazoline series. Bioorg Med Chem Lett 16:4686-91 (2006)  
Target
Name:
Receptor tyrosine-protein kinase erbB-2
Synonyms:
2.7.10.1 CD_antigen=CD340 ERBB2_HUMAN FASN/HER2 HER2 MLN19 NEU Proto-oncogene Neu Tyrosine kinase-type cell surface receptor HER2 | p185erbB2
Type:
Mol. Mass.:
137894.47
Organism:
Homo sapiens (Human)
Description:
P04626
Residue:
1255
  
Inhibitor
Name:
BDBM50189127
Synonyms:
CHEMBL212251 | N-(4-(3-fluorobenzyloxy)-3-chlorophenyl)-6-(5-(((2-(methylsulfonyl)ethyl)(propyl)amino)methyl)furan-2-yl)quinazolin-4-amine
Type:
Small organic molecule
Emp. Form.:
C32H32ClFN4O4S
Mol. Mass.:
623.137
SMILES:
CCCN(CCS(C)(=O)=O)Cc1ccc(o1)-c1ccc2ncnc(Nc3ccc(OCc4cccc(F)c4)c(Cl)c3)c2c1
: