Target
Epidermal growth factor receptor
Ligand
BDBM50189106
Substrate
Meas. Tech.
ChEMBL_396273 (CHEMBL910357)
IC50
90±n/a nM
Citation
 Petrov, KGZhang, YMCarter, MCockerill, GSDickerson, SGauthier, CAGuo, YMook, RARusnak, DWWalker, ALWood, ERLackey, KE Optimization and SAR for dual ErbB-1/ErbB-2 tyrosine kinase inhibition in the 6-furanylquinazoline series. Bioorg Med Chem Lett 16:4686-91 (2006)  
Target
Name:
Epidermal growth factor receptor
Synonyms:
EGF Receptor Substrate EGFR_HUMAN ERBB1 Epidermal Growth Factor Receptor erbB-1 Epidermal growth factor receptor (EGFR) HER1 Proto-oncogene c-ErbB-1 Tyrosine-Protein Kinase ErbB-1
Type:
Receptor Kinase Domain
Mol. Mass.:
134279.59
Organism:
Homo sapiens (Human)
Description:
P00533
Residue:
1210
  
Inhibitor
Name:
BDBM50189106
Synonyms:
CHEMBL445572 | N-(4-(3-fluorobenzyloxy)-3-chlorophenyl)-6-(5-((benzyl(2-(methylsulfonyl)ethyl)amino)methyl)furan-2-yl)quinazolin-4-amine
Type:
Small organic molecule
Emp. Form.:
C36H32ClFN4O4S
Mol. Mass.:
671.18
SMILES:
CS(=O)(=O)CCN(Cc1ccc(o1)-c1ccc2ncnc(Nc3ccc(OCc4cccc(F)c4)c(Cl)c3)c2c1)Cc1ccccc1
: