Target
Metabotropic glutamate receptor 5
Ligand
BDBM50191143
Substrate
Meas. Tech.
ChEMBL_397503 (CHEMBL864285)
IC50
1540±n/a nM
Citation
 Bach, PNilsson, KWållberg, ABauer, UHammerland, LGPeterson, ASvensson, TOsterlund, KKaris, DBoije, MWensbo, D A new series of pyridinyl-alkynes as antagonists of the metabotropic glutamate receptor 5 (mGluR5). Bioorg Med Chem Lett 16:4792-5 (2006)  
Target
Name:
Metabotropic glutamate receptor 5
Synonyms:
GPRC1E GRM5_HUMAN metabotropic glutamate 5 | metabotropic glutamate 5a
Type:
Enzyme
Mol. Mass.:
132484.72
Organism:
Homo sapiens (Human)
Description:
Residue:
1212
  
Inhibitor
Name:
BDBM50191143
Synonyms:
2-(3-(3-methoxyphenoxy)prop-1-ynyl)pyridine | CHEMBL212018
Type:
Small organic molecule
Emp. Form.:
C15H13NO2
Mol. Mass.:
239.2692
SMILES:
COc1cccc(OCC#Cc2ccccn2)c1
: