Target
P2Y purinoceptor 4
Ligand
BDBM50199173
Substrate
Meas. Tech.
ChEMBL_413297 (CHEMBL912410)
EC50
7200±n/a nM
Citation
 El-Tayeb, AQi, AMüller, CE Synthesis and structure-activity relationships of uracil nucleotide derivatives and analogues as agonists at human P2Y2, P2Y4, and P2Y6 receptors. J Med Chem 49:7076-87 (2006)  
Target
Name:
P2Y purinoceptor 4
Synonyms:
NRU P2RY4 P2Y purinoceptor 4 Pyrimidinergic receptor P2Y4 Uridine nucleotide receptor
Type:
PROTEIN
Mol. Mass.:
40977.17
Organism:
Homo sapiens (Human)
Description:
ChEMBL_751027
Residue:
365
  
Inhibitor
Name:
BDBM50199173
Synonyms:
((2R,3S,4R,5R)-5-(5-bromo-2,4-dioxo-3,4-dihydropyrimidin-1(2H)-yl)-3,4-dihydroxytetrahydrofuran-2-yl)methyl trihydrogen diphosphate CHEMBL214698
Type:
Small organic molecule
Emp. Form.:
C9H13BrN2O12P2
Mol. Mass.:
483.057
SMILES:
O[C@H]1[C@@H](O)[C@@H](O[C@@H]1COP(O)(=O)OP(O)(O)=O)n1cc(Br)c(=O)[nH]c1=O
: