Target
P2Y purinoceptor 4
Ligand
BDBM50199189
Substrate
Meas. Tech.
ChEMBL_413297 (CHEMBL912410)
EC50
>100000±n/a nM
Citation
 El-Tayeb, AQi, AMüller, CE Synthesis and structure-activity relationships of uracil nucleotide derivatives and analogues as agonists at human P2Y2, P2Y4, and P2Y6 receptors. J Med Chem 49:7076-87 (2006)  
Target
Name:
P2Y purinoceptor 4
Synonyms:
NRU P2RY4 P2Y purinoceptor 4 Pyrimidinergic receptor P2Y4 Uridine nucleotide receptor
Type:
PROTEIN
Mol. Mass.:
40977.17
Organism:
Homo sapiens (Human)
Description:
ChEMBL_751027
Residue:
365
  
Inhibitor
Name:
BDBM50199189
Synonyms:
6-methyl-3-beta-D-ribofuranosyl(1H)pyrimidine-2,4-dione 5'-triphosphate | CHEMBL413841
Type:
Small organic molecule
Emp. Form.:
C10H17N2O15P3
Mol. Mass.:
498.1677
SMILES:
Cc1cc(=O)n([C@@H]2O[C@H](COP(O)(=O)OP(O)(=O)OP(O)(O)=O)[C@@H](O)[C@H]2O)c(=O)[nH]1
: