Target
Cannabinoid receptor 1
Ligand
BDBM50195514
Substrate
Meas. Tech.
ChEMBL_414848 (CHEMBL855029)
Ki
143.2±n/a nM
Citation
 Manera, CBenetti, VCastelli, MPCavallini, TLazzarotti, SPibiri, FSaccomanni, GTuccinardi, TVannacci, AMartinelli, AFerrarini, PL Design, synthesis, and biological evaluation of new 1,8-naphthyridin-4(1H)-on-3-carboxamide and quinolin-4(1H)-on-3-carboxamide derivatives as CB2 selective agonists. J Med Chem 49:5947-57 (2006)  
Target
Name:
Cannabinoid receptor 1
Synonyms:
Brain-type cannabinoid receptor CB-R CNR1_MOUSE Cannabinoid receptor | Cnr1
Type:
Enzyme
Mol. Mass.:
52842.52
Organism:
Mus musculus (Mouse)
Description:
P47746
Residue:
473
  
Inhibitor
Name:
BDBM50195514
Synonyms:
CHEMBL217266 | N-cycloheptyl-1-benzyl-7-methyl-1,8-naphthyridin-4(1H)-on-3-carboxamide
Type:
Small organic molecule
Emp. Form.:
C24H27N3O2
Mol. Mass.:
389.4901
SMILES:
Cc1ccc2c(n1)n(Cc1ccccc1)cc(C(=O)NC1CCCCCC1)c2=O
: