Target
Cannabinoid receptor 1
Ligand
BDBM50195511
Substrate
Meas. Tech.
ChEMBL_414848 (CHEMBL855029)
Ki
37.5±n/a nM
Citation
 Manera, CBenetti, VCastelli, MPCavallini, TLazzarotti, SPibiri, FSaccomanni, GTuccinardi, TVannacci, AMartinelli, AFerrarini, PL Design, synthesis, and biological evaluation of new 1,8-naphthyridin-4(1H)-on-3-carboxamide and quinolin-4(1H)-on-3-carboxamide derivatives as CB2 selective agonists. J Med Chem 49:5947-57 (2006)  
Target
Name:
Cannabinoid receptor 1
Synonyms:
Brain-type cannabinoid receptor CB-R CNR1_MOUSE Cannabinoid receptor | Cnr1
Type:
Enzyme
Mol. Mass.:
52842.52
Organism:
Mus musculus (Mouse)
Description:
P47746
Residue:
473
  
Inhibitor
Name:
BDBM50195511
Synonyms:
CHEMBL217549 | N-(4'-methylcyclohexyl)-1-(o-fluorobenzyl)-7-methyl-1,8-naphthyridin-4(1H)-on-3-carboxamide
Type:
Small organic molecule
Emp. Form.:
C24H26FN3O2
Mol. Mass.:
407.4805
SMILES:
CC1CCC(CC1)NC(=O)c1cn(Cc2ccccc2F)c2nc(C)ccc2c1=O
: