Target
Cannabinoid receptor 2
Ligand
BDBM50195516
Substrate
Meas. Tech.
ChEMBL_414849 (CHEMBL855031)
Ki
1.4±n/a nM
Citation
 Manera, CBenetti, VCastelli, MPCavallini, TLazzarotti, SPibiri, FSaccomanni, GTuccinardi, TVannacci, AMartinelli, AFerrarini, PL Design, synthesis, and biological evaluation of new 1,8-naphthyridin-4(1H)-on-3-carboxamide and quinolin-4(1H)-on-3-carboxamide derivatives as CB2 selective agonists. J Med Chem 49:5947-57 (2006)  
Target
Name:
Cannabinoid receptor 2
Synonyms:
CANNABINOID CB2 CB2 Cannabinoid CB2 receptor Cannabinoid receptor 2 mCB2
Type:
Enzyme Catalytic Domain
Mol. Mass.:
38220.43
Organism:
MOUSE
Description:
P47936
Residue:
347
  
Inhibitor
Name:
BDBM50195516
Synonyms:
CHEMBL216382 | N-(4'-methylcyclohexyl)-1-(p-fluorobenzyl)-7-methyl-1,8-naphthyridin-4(1H)-on-3-carboxamide
Type:
Small organic molecule
Emp. Form.:
C24H26FN3O2
Mol. Mass.:
407.4805
SMILES:
CC1CCC(CC1)NC(=O)c1cn(Cc2ccc(F)cc2)c2nc(C)ccc2c1=O
: