Target
Type-2 angiotensin II receptor
Ligand
BDBM50195698
Substrate
Meas. Tech.
ChEMBL_414989 (CHEMBL909478)
Ki
4.7±n/a nM
Citation
 Rosenström, USköld, CLindeberg, GBotros, MNyberg, FKarlén, AHallberg, A Design, synthesis, and incorporation of a beta-turn mimetic in angiotensin II forming novel pseudopeptides with affinity for AT1 and AT2 receptors. J Med Chem 49:6133-7 (2006)  
Target
Name:
Type-2 angiotensin II receptor
Synonyms:
AGTR2 AT2 Angiotensin II type 2 (AT-2) receptor Type-2 angiotensin II receptor
Type:
Enzyme Catalytic Domain
Mol. Mass.:
41201.61
Organism:
Homo sapiens (Human)
Description:
Angiotensin II, central 0 0::P50052
Residue:
363
  
Inhibitor
Name:
BDBM50195698
Synonyms:
(3S)-3-amino-3-{[(1S)-1-{[(2S)-2-[(2S)-butan-2-yl]-4-({[(2S)-1-[(2S)-2-{[(1S)-1-carboxy-2-phenylethyl]carbamoyl}pyrrolidin-1-yl]-3-(1H-imidazol-4-yl)-1-oxopropan-2-yl]carbamoyl}methyl)-9-[(4-hydroxyphenyl)methyl]-3-oxo-2,3,4,5-tetrahydro-1H-1,4-benzodiazepin-7-yl]carbamoyl}-4-[(diaminomethylidene)amino]butyl]carbamoyl}propanoic acid | CHEMBL265613
Type:
Small organic molecule
Emp. Form.:
C52H67N13O11
Mol. Mass.:
1050.1689
SMILES:
CC[C@H](C)[C@@H]1Nc2c(Cc3ccc(O)cc3)cc(NC(=O)[C@H](CCCN=C(N)N)NC(=O)[C@@H](N)CC(O)=O)cc2CN(CC(=O)N[C@@H](Cc2cnc[nH]2)C(=O)N2CCC[C@H]2C(=O)N[C@@H](Cc2ccccc2)C(O)=O)C1=O
: