Target
Peptide deformylase 1A, chloroplastic/mitochondrial
Ligand
BDBM50201875
Substrate
Meas. Tech.
ChEMBL_423228 (CHEMBL912247)
IC50
>1000000±n/a nM
Citation
 Boularot, AGiglione, CPetit, SDuroc, YAlves de Sousa, RLarue, VCresteil, TDardel, FArtaud, IMeinnel, T Discovery and refinement of a new structural class of potent peptide deformylase inhibitors. J Med Chem 50:10-20 (2007)  
Target
Name:
Peptide deformylase 1A, chloroplastic/mitochondrial
Synonyms:
AtDEF1 DEF1 PDF 1A Peptide deformylase 1A, chloroplastic | Polypeptide deformylase
Type:
PROTEIN
Mol. Mass.:
30001.50
Organism:
Arabidopsis thaliana
Description:
ChEMBL_423228
Residue:
269
  
Inhibitor
Name:
BDBM50201875
Synonyms:
2-(5-methoxy-1H-indol-3-yl)-N-hydroxyacetamide | CHEMBL219859
Type:
Small organic molecule
Emp. Form.:
C12H14N2O3
Mol. Mass.:
234.2512
SMILES:
COc1ccc2[nH]cc(CC(=O)CNO)c2c1
: