Target
Prostaglandin E2 receptor EP3 subtype
Ligand
BDBM50193924
Substrate
Meas. Tech.
ChEMBL_424247 (CHEMBL909021)
Ki
46±n/a nM
Citation
 Belley, MChan, CCGareau, YGallant, MJuteau, HHoude, KLachance, NLabelle, MSawyer, NTremblay, NLamontagne, SCarrière, MCDenis, DGreig, GMSlipetz, DGordon, RChauret, NLi, CZamboni, RJMetters, KM Comparison between two classes of selective EP(3) antagonists and their biological activities. Bioorg Med Chem Lett 16:5639-42 (2006)  
Target
Name:
Prostaglandin E2 receptor EP3 subtype
Synonyms:
PE2R3_HUMAN PGE2-R Prostaglandin E2 receptor Prostaglandin E2 receptor EP3 subtype (EP3) Prostaglandin E2 receptor EP3D subtype (EP3D) | Prostanoid EP3 receptor
Type:
Enzyme
Mol. Mass.:
43335.03
Organism:
Homo sapiens (Human)
Description:
P43115
Residue:
390
  
Inhibitor
Name:
BDBM50193924
Synonyms:
3-(2-((6-(benzyloxy)naphthalen-2-yl)methyl)phenyl)acrylic acid | CHEMBL218263
Type:
Small organic molecule
Emp. Form.:
C27H22O3
Mol. Mass.:
394.4618
SMILES:
OC(=O)\C=C\c1ccccc1Cc1ccc2cc(OCc3ccccc3)ccc2c1
: